Skip to content
Started by user Ian
Running as SYSTEM
Building in workspace /var/jenkins_home/workspace/thoughtframe-core
The recommended git tool is: NONE
using credential fb100dcd-4304-4afa-a315-b11d10af3b06
Cloning the remote Git repository
Cloning repository https://thoughtframe.ai/thoughtframe/classes/AZhhg2hJgniNmOZnUs4e/code/repo/thoughtframe-core/thoughtframe-core
 > git init /var/jenkins_home/workspace/thoughtframe-core # timeout=10
Fetching upstream changes from https://thoughtframe.ai/thoughtframe/classes/AZhhg2hJgniNmOZnUs4e/code/repo/thoughtframe-core/thoughtframe-core
 > git --version # timeout=10
 > git --version # 'git version 2.47.3'
using GIT_ASKPASS to set credentials 
 > git fetch --tags --force --progress -- https://thoughtframe.ai/thoughtframe/classes/AZhhg2hJgniNmOZnUs4e/code/repo/thoughtframe-core/thoughtframe-core +refs/heads/*:refs/remotes/origin/* # timeout=10
 > git config remote.origin.url https://thoughtframe.ai/thoughtframe/classes/AZhhg2hJgniNmOZnUs4e/code/repo/thoughtframe-core/thoughtframe-core # timeout=10
 > git config --add remote.origin.fetch +refs/heads/*:refs/remotes/origin/* # timeout=10
Avoid second fetch
 > git rev-parse refs/remotes/origin/master^{commit} # timeout=10
Checking out Revision 38de0decd20863e3c9eebf442a4281936e7bb0c9 (refs/remotes/origin/master)
 > git config core.sparsecheckout # timeout=10
 > git checkout -f 38de0decd20863e3c9eebf442a4281936e7bb0c9 # timeout=10
Commit message: "cms/openedit: require administrators for all editor view permissions"
First time build. Skipping changelog.
[thoughtframe-core] $ /bin/sh -xe /tmp/jenkins15821529926344934140.sh
+ export JAVA_HOME=/var/jenkins_home/tools/jdk-25
+ export PATH=/var/jenkins_home/tools/jdk-25/bin:/opt/java/openjdk/bin:/usr/local/sbin:/usr/local/bin:/usr/sbin:/usr/bin:/sbin:/bin
+ java -version
openjdk version "25.0.4.1" 2026-08-18 LTS
OpenJDK Runtime Environment Temurin-25.0.4.1+1 (build 25.0.4.1+1-LTS)
OpenJDK 64-Bit Server VM Temurin-25.0.4.1+1 (build 25.0.4.1+1-LTS, mixed mode, sharing)
+ ./gradlew :thoughtframe:createWar --no-daemon
Downloading https://services.gradle.org/distributions/gradle-9.7.1-bin.zip
..............10%..............20%...............30%..............40%...............50%..............60%...............70%..............80%..............90%...............100%

Welcome to Gradle 9.7.1!

Here are the highlights of this release:
 - Isolated Projects graduates to incubating
 - Broader Configuration Cache compatibility
 - Resilient Sync helps you fix broken builds
 - More source locations in problem reports

For more details see https://docs.gradle.org/9.7.1/release-notes.html

To honour the JVM settings for this build a single-use Daemon process will be forked. For more on this, please refer to https://docs.gradle.org/9.7.1/userguide/gradle_daemon.html#sec:disabling_the_daemon in the Gradle documentation.
Daemon will be stopped at the end of the build 

> Task :core:compileJava
/var/jenkins_home/workspace/thoughtframe-core/core/src/main/java/org/openedit/util/SessionTool.java:121: warning: non-varargs call of varargs method with inexact argument type for last parameter;
				return constructors[i].newInstance( null );
				                                    ^
  cast to Object for a varargs call
  cast to Object[] for a non-varargs call and to suppress this warning
Note: Some input files use or override a deprecated API.
Note: Recompile with -Xlint:deprecation for details.
Note: Some input files use unchecked or unsafe operations.
Note: Recompile with -Xlint:unchecked for details.
1 warning

> Task :core:processResources
> Task :core:classes
> Task :core:jar

> Task :dam:compileJava
Note: Some input files use or override a deprecated API.
Note: Recompile with -Xlint:deprecation for details.
Note: Some input files use unchecked or unsafe operations.
Note: Recompile with -Xlint:unchecked for details.

> Task :dam:processResources
> Task :dam:classes
> Task :dam:jar
> Task :runtime-api:compileJava
> Task :runtime-api:processResources NO-SOURCE
> Task :runtime-api:classes
> Task :runtime-api:jar
> Task :thoughtframe:unpackKnnPlugin

> Task :thoughtframe:compileJava
Note: Some input files use or override a deprecated API.
Note: Recompile with -Xlint:deprecation for details.
Note: Some input files use unchecked or unsafe operations.
Note: Recompile with -Xlint:unchecked for details.

> Task :thoughtframe:compileGroovy
> Task :thoughtframe:processResources
> Task :thoughtframe:classes
> Task :thoughtframe:createWar FAILED

[Incubating] Problems report is available at: file:///var/jenkins_home/workspace/thoughtframe-core/build/reports/problems/problems-report.html

FAILURE: Build failed with an exception.

* What went wrong:
Execution failed for task ':thoughtframe:createWar' (registered in build file 'thoughtframe/build.gradle').
> Couldn't follow symbolic link '/var/jenkins_home/workspace/thoughtframe-core/thoughtframe/webapp/WEB-INF/base/emfrontend'.

* Try:
> Run with --stacktrace option to get the stack trace.
> Run with --info or --debug option to get more log output.
> Run with --scan to get full insights from a Build Scan (powered by Develocity).
> Get more help at https://help.gradle.org.

Deprecated Gradle features were used in this build, making it incompatible with Gradle 10.

You can use '--warning-mode all' to show the individual deprecation warnings and determine if they come from your own scripts or plugins.

For more on this, please refer to https://docs.gradle.org/9.7.1/userguide/command_line_interface.html#sec:command_line_warnings in the Gradle documentation.

BUILD FAILED in 1m 25s
13 actionable tasks: 13 executed
Build step 'Execute shell' marked build as failure
Finished: FAILURE