Skip to content
Started by user Ian
Running as SYSTEM
Building in workspace /var/jenkins_home/workspace/thoughtframe-core
The recommended git tool is: NONE
using credential fb100dcd-4304-4afa-a315-b11d10af3b06
 > git rev-parse --resolve-git-dir /var/jenkins_home/workspace/thoughtframe-core/.git # timeout=10
Fetching changes from the remote Git repository
 > git config remote.origin.url https://thoughtframe.ai/thoughtframe/classes/AZhhg2hJgniNmOZnUs4e/code/repo/thoughtframe-core/thoughtframe-core # timeout=10
Fetching upstream changes from https://thoughtframe.ai/thoughtframe/classes/AZhhg2hJgniNmOZnUs4e/code/repo/thoughtframe-core/thoughtframe-core
 > git --version # timeout=10
 > git --version # 'git version 2.47.3'
using GIT_ASKPASS to set credentials 
 > git fetch --tags --force --progress -- https://thoughtframe.ai/thoughtframe/classes/AZhhg2hJgniNmOZnUs4e/code/repo/thoughtframe-core/thoughtframe-core +refs/heads/*:refs/remotes/origin/* # timeout=10
 > git rev-parse refs/remotes/origin/master^{commit} # timeout=10
Checking out Revision 6b5002ef899ec9888b3fa08a3cd798af98b3ef5c (refs/remotes/origin/master)
 > git config core.sparsecheckout # timeout=10
 > git checkout -f 6b5002ef899ec9888b3fa08a3cd798af98b3ef5c # timeout=10
Commit message: "thoughtframe: untrack the setupLinks-generated symlinks"
 > git rev-list --no-walk 38de0decd20863e3c9eebf442a4281936e7bb0c9 # timeout=10
[thoughtframe-core] $ /bin/sh -xe /tmp/jenkins5350665418623101667.sh
+ export JAVA_HOME=/var/jenkins_home/tools/jdk-25
+ export PATH=/var/jenkins_home/tools/jdk-25/bin:/opt/java/openjdk/bin:/usr/local/sbin:/usr/local/bin:/usr/sbin:/usr/bin:/sbin:/bin
+ java -version
openjdk version "25.0.4.1" 2026-08-18 LTS
OpenJDK Runtime Environment Temurin-25.0.4.1+1 (build 25.0.4.1+1-LTS)
OpenJDK 64-Bit Server VM Temurin-25.0.4.1+1 (build 25.0.4.1+1-LTS, mixed mode, sharing)
+ ./gradlew :thoughtframe:createWar --no-daemon
To honour the JVM settings for this build a single-use Daemon process will be forked. For more on this, please refer to https://docs.gradle.org/9.7.1/userguide/gradle_daemon.html#sec:disabling_the_daemon in the Gradle documentation.
Daemon will be stopped at the end of the build 
> Task :core:compileJava UP-TO-DATE
> Task :core:processResources UP-TO-DATE
> Task :core:classes UP-TO-DATE
> Task :core:jar UP-TO-DATE
> Task :dam:compileJava UP-TO-DATE
> Task :dam:processResources UP-TO-DATE
> Task :dam:classes UP-TO-DATE
> Task :dam:jar UP-TO-DATE
> Task :runtime-api:compileJava UP-TO-DATE
> Task :runtime-api:processResources NO-SOURCE
> Task :runtime-api:classes UP-TO-DATE
> Task :runtime-api:jar UP-TO-DATE
> Task :thoughtframe:unpackKnnPlugin UP-TO-DATE
> Task :thoughtframe:compileJava UP-TO-DATE
> Task :thoughtframe:compileGroovy UP-TO-DATE
> Task :thoughtframe:processResources UP-TO-DATE
> Task :thoughtframe:classes UP-TO-DATE

> Task :thoughtframe:setupLinks
Linking /var/jenkins_home/workspace/thoughtframe-core/thoughtframe/webapp/WEB-INF/base/entermedia -> /var/jenkins_home/workspace/thoughtframe-core/dam/webapp/WEB-INF/base/entermedia
Linking /var/jenkins_home/workspace/thoughtframe-core/thoughtframe/webapp/WEB-INF/base/emfrontend2 -> /var/jenkins_home/workspace/thoughtframe-core/dam/webapp/WEB-INF/base/emfrontend2
Linking /var/jenkins_home/workspace/thoughtframe-core/thoughtframe/webapp/WEB-INF/base/system -> /var/jenkins_home/workspace/thoughtframe-core/dam/webapp/WEB-INF/base/system
Linking /var/jenkins_home/workspace/thoughtframe-core/thoughtframe/webapp/WEB-INF/base/manager -> /var/jenkins_home/workspace/thoughtframe-core/dam/webapp/WEB-INF/base/manager
Linking /var/jenkins_home/workspace/thoughtframe-core/thoughtframe/webapp/WEB-INF/base/mediadb -> /var/jenkins_home/workspace/thoughtframe-core/dam/webapp/WEB-INF/base/mediadb
Linking /var/jenkins_home/workspace/thoughtframe-core/thoughtframe/webapp/WEB-INF/base/openedit -> /var/jenkins_home/workspace/thoughtframe-core/cms/webapp/openedit

> Task :thoughtframe:createWar FAILED

[Incubating] Problems report is available at: file:///var/jenkins_home/workspace/thoughtframe-core/build/reports/problems/problems-report.html

FAILURE: Build failed with an exception.

* What went wrong:
Execution failed for task ':thoughtframe:createWar' (registered in build file 'thoughtframe/build.gradle').
> Couldn't follow symbolic link '/var/jenkins_home/workspace/thoughtframe-core/thoughtframe/webapp/WEB-INF/base/entermedia'.

* Try:
> Run with --stacktrace option to get the stack trace.
> Run with --info or --debug option to get more log output.
> Run with --scan to get full insights from a Build Scan (powered by Develocity).
> Get more help at https://help.gradle.org.

Deprecated Gradle features were used in this build, making it incompatible with Gradle 10.

You can use '--warning-mode all' to show the individual deprecation warnings and determine if they come from your own scripts or plugins.

For more on this, please refer to https://docs.gradle.org/9.7.1/userguide/command_line_interface.html#sec:command_line_warnings in the Gradle documentation.

BUILD FAILED in 19s
14 actionable tasks: 2 executed, 12 up-to-date
Build step 'Execute shell' marked build as failure
Finished: FAILURE